BDBM55564 2-(3-methylphenyl)-1H-naphtho[2,3-g]indazole-3,6,11-trione::2-(m-tolyl)-1H-naphth[2,3-g]indazole-3,6,11-trione::2-m-Tolyl-1,2-dihydro-naphtho[2,3-g]indazole-3,6,11-trione::MLS000554621::SMR000171820::cid_3126078
SMILES Cc1cccc(c1)-n1[nH]c2c3C(=O)c4ccccc4C(=O)c3ccc2c1=O
InChI Key InChIKey=YXGILANZIAAYJB-UHFFFAOYSA-N
Data  5 IC50  1 EC50
  Tab Delimited (TSV)   2D SDfile   Computed 3D by Vconf -m prep SDfile
Find this compound or compounds like it in BindingDB:
Activity Spreadsheet -- Enzyme Inhibition Constant Data from BindingDB
Found 6 hits for monomerid = 55564
TargetNeutrophil cytosol factor 1 [S99G](Homo sapiens (Human))
Emory University
Curated by PubChem BioAssay
LigandPNGBDBM55564(2-(3-methylphenyl)-1H-naphtho[2,3-g]indazole-3,6,1...)
Affinity DataIC50:  5.00E+4nM. Assay description: NIH Molecular Libraries Screening Centers Network [MLSCN] Emory Chemical Biology Discovery Center in MLSCN Assay provider: Susan Smith, Emory Univers...
In DepthDetails PCBioAssay
TargetNucleotide-binding oligomerization domain-containing protein 1(Homo sapiens (Human))
Burnham Center For Chemical Genomics
Curated by PubChem BioAssay
LigandPNGBDBM55564(2-(3-methylphenyl)-1H-naphtho[2,3-g]indazole-3,6,1...)
Affinity DataEC50:  8.50E+3nM. Assay description: Data Source: Sanford-Burnham Center for Chemical Genomics (SBCCG) Source Affiliation: Sanford-Burnham Medical Research Institute (SBMRI, San Diego, C...
In DepthDetails PCBioAssay
TargetTumor necrosis factor(Homo sapiens (Human))
Burnham Center For Chemical Genomics
Curated by PubChem BioAssay
LigandPNGBDBM55564(2-(3-methylphenyl)-1H-naphtho[2,3-g]indazole-3,6,1...)
Affinity DataIC50:  2.00E+4nM. Assay description: Data Source: Sanford-Burnham Center for Chemical Genomics (SBCCG) Source Affiliation: Sanford-Burnham Medical Research Institute (SBMRI, San Diego, C...
In DepthDetails PCBioAssay
TargetNucleotide-binding oligomerization domain-containing protein 2(Homo sapiens (Human))
Burnham Center For Chemical Genomics
Curated by PubChem BioAssay
LigandPNGBDBM55564(2-(3-methylphenyl)-1H-naphtho[2,3-g]indazole-3,6,1...)
Affinity DataIC50:  1.78E+4nM. Assay description: Data Source: Sanford-Burnham Center for Chemical Genomics (SBCCG) Source Affiliation: Sanford-Burnham Medical Research Institute (SBMRI, San Diego, C...
In DepthDetails PCBioAssay
TargetTumor necrosis factor(Homo sapiens (Human))
Burnham Center For Chemical Genomics
Curated by PubChem BioAssay
LigandPNGBDBM55564(2-(3-methylphenyl)-1H-naphtho[2,3-g]indazole-3,6,1...)
Affinity DataIC50:  1.63E+4nM. Assay description: Data Source: Sanford-Burnham Center for Chemical Genomics (SBCCG) Source Affiliation: Sanford-Burnham Medical Research Institute (SBMRI, San Diego, C...
In DepthDetails PCBioAssay
TargetNucleotide-binding oligomerization domain-containing protein 1(Homo sapiens (Human))
Burnham Center For Chemical Genomics
Curated by PubChem BioAssay
LigandPNGBDBM55564(2-(3-methylphenyl)-1H-naphtho[2,3-g]indazole-3,6,1...)
Affinity DataIC50:  1.71E+4nM. Assay description: Data Source: Sanford-Burnham Center for Chemical Genomics (SBCCG) Source Affiliation: Sanford-Burnham Medical Research Institute (SBMRI, San Diego, C...
In DepthDetails PCBioAssay