BDBM61931 KSC-6-119::KUC104218N::N-(3-keto-2-phenyl-1,2-benzothiazol-6-yl)acetamide::N-(3-oxidanylidene-2-phenyl-1,2-benzothiazol-6-yl)ethanamide::N-(3-oxo-2-phenyl-1,2-benzothiazol-6-yl)acetamide::cid_44623833
SMILES CC(=O)Nc1ccc2c(c1)sn(-c1ccccc1)c2=O
InChI Key InChIKey=MUZGWPOHOQOQKK-UHFFFAOYSA-N
Data  4 IC50
  Tab Delimited (TSV)   2D SDfile   Computed 3D by Vconf -m prep SDfile
Find this compound or compounds like it in BindingDB:
Activity Spreadsheet -- Enzyme Inhibition Constant Data from BindingDB
Found 4 hits for monomerid = 61931
TargetGlucose-6-phosphate 1-dehydrogenase(Leuconostoc mesenteroides)
University Of Pittsburgh
Curated by PubChem BioAssay
LigandPNGBDBM61931(KSC-6-119 | KUC104218N | N-(3-keto-2-phenyl-1,2-be...)
Affinity DataIC50: >2.50E+4nM. Assay description: Excerpt from MH082340 application (Dr. James Morris, Clemson University) Trypanosoma brucei, the digenic protozoan parasite that causes African sleep...
In DepthDetails PCBioAssay
TargetToll-like receptor 9(Homo sapiens (Human))
The Scripps Research Institute Molecular Screening Center
Curated by PubChem BioAssay
LigandPNGBDBM61931(KSC-6-119 | KUC104218N | N-(3-keto-2-phenyl-1,2-be...)
Affinity DataIC50:  1.24E+4nM. Assay description: Source (MLPCN Center Name): The Scripps Research Institute Molecular Screening Center (SRIMSC) Affiliation: The Scripps Research Institute, TSRI Assa...
In DepthDetails PCBioAssay
TargetBeta-lactamase(Pseudomonas aeruginosa)
The Scripps Research Institute Molecular Screening Center
Curated by PubChem BioAssay
LigandPNGBDBM61931(KSC-6-119 | KUC104218N | N-(3-keto-2-phenyl-1,2-be...)
Affinity DataIC50:  1.44E+4nM. Assay description: Source (MLPCN Center Name): The Scripps Research Institute Molecular Screening Center (SRIMSC) Affiliation: The Scripps Research Institute, TSRI Assa...
In DepthDetails PCBioAssay
TargetPhosphotransferase(Trypanosoma brucei)
University Of Pittsburgh
Curated by PubChem BioAssay
LigandPNGBDBM61931(KSC-6-119 | KUC104218N | N-(3-keto-2-phenyl-1,2-be...)
Affinity DataIC50:  3.92E+3nM. Assay description: Excerpt from MH0882340 application (Dr. James Morris, Clemson University) Trypanosoma brucei, the digenic protozoan parasite that causes African slee...
In DepthDetails PCBioAssay