BDBM64875 Furan-2-carboxylic acid (2-diphenylacetylamino-ethyl)-amide::MLS000075430::N-[2-(2,2-diphenylethanoylamino)ethyl]furan-2-carboxamide::N-[2-[(1-oxo-2,2-diphenylethyl)amino]ethyl]-2-furancarboxamide::N-[2-[(2,2-diphenylacetyl)amino]ethyl]-2-furamide::N-[2-[(2,2-diphenylacetyl)amino]ethyl]furan-2-carboxamide::SMR000014686::cid_647481
SMILES O=C(NCCNC(=O)c1ccco1)C(c1ccccc1)c1ccccc1
InChI Key InChIKey=ZPMWWHDGKIWLBN-UHFFFAOYSA-N
Data  1 EC50
  Tab Delimited (TSV)   2D SDfile   Computed 3D by Vconf -m prep SDfile
Find this compound or compounds like it in BindingDB:
Activity Spreadsheet -- Enzyme Inhibition Constant Data from BindingDB
Found 1 hit for monomerid = 64875
TargetATP-dependent molecular chaperone HSP82(Candida albicans)
Broad Institute
Curated by PubChem BioAssay
LigandPNGBDBM64875(Furan-2-carboxylic acid (2-diphenylacetylamino-eth...)
Affinity DataEC50: >1.50E+5nM. Assay description: Broad Institute: Reversing Antifungal Drug Resistance Project ID: 2037 Keywords: Candida albicans, drug resistance, Fluconazole, Hsp90, Calcineurin, ...
In DepthDetails PCBioAssay