BDBM64895 1-(2,4-dichlorophenyl)-2-(5-ethanoyl-1,2,4-triazol-1-yl)ethanone::2-(5-acetyl-1,2,4-triazol-1-yl)-1-(2,4-dichlorophenyl)ethanone::MLS000038195::SMR000036609::cid_658497
SMILES CC(=O)c1ncnn1CC(=O)c1ccc(Cl)cc1Cl
InChI Key InChIKey=JYNXTBPXQZPWGG-UHFFFAOYSA-N
Data  1 EC50
  Tab Delimited (TSV)   2D SDfile   Computed 3D by Vconf -m prep SDfile
Find this compound or compounds like it in BindingDB:
Activity Spreadsheet -- Enzyme Inhibition Constant Data from BindingDB
Found 1 hit for monomerid = 64895
TargetATP-dependent molecular chaperone HSP82(Candida albicans)
Broad Institute
Curated by PubChem BioAssay
LigandPNGBDBM64895(1-(2,4-dichlorophenyl)-2-(5-ethanoyl-1,2,4-triazol...)
Affinity DataEC50: >1.60E+5nM. Assay description: Broad Institute: Reversing Antifungal Drug Resistance Project ID: 2037 Keywords: Candida albicans, drug resistance, Fluconazole, Hsp90, Calcineurin, ...
In DepthDetails PCBioAssay