BDBM64903 MLS000040320::SMR000043552::[butoxy-[4-(dimethylamino)phenyl]phosphoryl]-(2-fluorophenyl)methanol::cid_662836
SMILES CCCCOP(=O)(C(O)c1ccccc1F)c1ccc(cc1)N(C)C
InChI Key InChIKey=WZNDXVXFTQSMTA-UHFFFAOYSA-N
Data  1 EC50
  Tab Delimited (TSV)   2D SDfile   Computed 3D by Vconf -m prep SDfile
Find this compound or compounds like it in BindingDB:
Activity Spreadsheet -- Enzyme Inhibition Constant Data from BindingDB
Found 1 hit for monomerid = 64903
TargetATP-dependent molecular chaperone HSP82(Candida albicans)
Broad Institute
Curated by PubChem BioAssay
LigandPNGBDBM64903(MLS000040320 | SMR000043552 | [butoxy-[4-(dimethyl...)
Affinity DataEC50:  4.66E+3nM. Assay description: Broad Institute: Reversing Antifungal Drug Resistance Project ID: 2037 Keywords: Candida albicans, drug resistance, Fluconazole, Hsp90, Calcineurin, ...
In DepthDetails PCBioAssay