BDBM67448 MLS001142046::N-(6-amino-1-benzyl-2,4-diketo-pyrimidin-5-yl)-4-(1H-benzimidazol-2-ylthio)-N-isoamyl-butyramide::N-(6-amino-1-benzyl-2,4-dioxopyrimidin-5-yl)-4-(1H-benzimidazol-2-ylsulfanyl)-N-(3-methylbutyl)butanamide::N-[6-amino-2,4-dioxo-1-(phenylmethyl)-5-pyrimidinyl]-4-(1H-benzimidazol-2-ylthio)-N-(3-methylbutyl)butanamide::N-[6-azanyl-2,4-bis(oxidanylidene)-1-(phenylmethyl)pyrimidin-5-yl]-4-(1H-benzimidazol-2-ylsulfanyl)-N-(3-methylbutyl)butanamide::SMR000716634::cid_24980104
SMILES CC(C)CCN(C(=O)CCCSc1nc2ccccc2[nH]1)c1c(N)n(Cc2ccccc2)c(=O)[nH]c1=O
InChI Key InChIKey=UPMPGAPYHHIDIC-UHFFFAOYSA-N
Data  2 IC50
  Tab Delimited (TSV)   2D SDfile   Computed 3D by Vconf -m prep SDfile
Find this compound or compounds like it in BindingDB:
Activity Spreadsheet -- Enzyme Inhibition Constant Data from BindingDB
Found 2 hits for monomerid = 67448
TargetFemale germline-specific tumor suppressor gld-1(Caenorhabditis elegans)
The Scripps Research Institute Molecular Screening Center
Curated by PubChem BioAssay
LigandPNGBDBM67448(MLS001142046 | N-(6-amino-1-benzyl-2,4-diketo-pyri...)
Affinity DataIC50:  3.12E+3nM. Assay description: Source (MLPCN Center Name): The Scripps Research Institute Molecular Screening Center (SRIMSC) Affiliation: The Scripps Research Institute, TSRI Assa...
In DepthDetails PCBioAssay
TargetProtein Rev(Human immunodeficiency virus 1)
The Scripps Research Institute Molecular Screening Center
Curated by PubChem BioAssay
LigandPNGBDBM67448(MLS001142046 | N-(6-amino-1-benzyl-2,4-diketo-pyri...)
Affinity DataIC50: >8.38E+3nM. Assay description: Source (MLPCN Center Name): The Scripps Research Institute Molecular Screening Center (SRIMSC) Affiliation: The Scripps Research Institute, TSRI Assa...
In DepthDetails PCBioAssay