BDBM81272 1-methyl-4-(2-tosylvinylsulfonyl)benzene::1-methyl-4-[2-(4-methylphenyl)sulfonylethenylsulfonyl]benzene::MLS002920500::SMR001798089::cid_284471
SMILES Cc1ccc(cc1)S(=O)(=O)C=CS(=O)(=O)c1ccc(C)cc1
InChI Key InChIKey=ONVBDYWGWKUWMH-UHFFFAOYSA-N
Data  2 IC50  1 EC50
  Tab Delimited (TSV)   2D SDfile   Computed 3D by Vconf -m prep SDfile
Find this compound or compounds like it in BindingDB:
Activity Spreadsheet -- Enzyme Inhibition Constant Data from BindingDB
Found 3 hits for monomerid = 81272
TargetBeta-lactamase(Pseudomonas aeruginosa)
The Scripps Research Institute Molecular Screening Center
Curated by PubChem BioAssay
LigandPNGBDBM81272(1-methyl-4-(2-tosylvinylsulfonyl)benzene | 1-methy...)
Affinity DataIC50:  1.36E+4nM. Assay description: Source (MLPCN Center Name): The Scripps Research Institute Molecular Screening Center (SRIMSC) Affiliation: The Scripps Research Institute, TSRI Assa...
Ligand InfoPC cidPC sid
In DepthDetails PCBioAssay
TargetV-type proton ATPase subunit c'(Saccharomyces cerevisiae S288c)
Nmmlsc
Curated by PubChem BioAssay
LigandPNGBDBM81272(1-methyl-4-(2-tosylvinylsulfonyl)benzene | 1-methy...)
Affinity DataEC50:  3.91E+3nM. Assay description: University of New Mexico Assay Overview: Assay Support: 1 R03 DA031666-01A1 Project Title: Flow Cytometry HTS of Small Molecules that Regulate V-ATPa...
Ligand InfoPC cidPC sid
In DepthDetails PCBioAssay
TargetToll-like receptor 9(Homo sapiens (Human))
The Scripps Research Institute Molecular Screening Center
Curated by PubChem BioAssay
LigandPNGBDBM81272(1-methyl-4-(2-tosylvinylsulfonyl)benzene | 1-methy...)
Affinity DataIC50:  8.54E+3nM. Assay description: Source (MLPCN Center Name): The Scripps Research Institute Molecular Screening Center (SRIMSC) Affiliation: The Scripps Research Institute, TSRI Assa...
Ligand InfoPC cidPC sid
In DepthDetails PCBioAssay