BDBM81338 PhGTP (10b)
SMILES Nc1nc2n([C@@H]3O[C@H](COP([O-])(=O)OP([O-])(=O)OP(O)([O-])=O)C(O)C3O)c(nc2c(=O)[nH]1)-c1ccccc1
InChI Key InChIKey=NTSZGXBZLMMEJH-YFCRMBKLSA-K
Data  1 IC50
  Tab Delimited (TSV)   2D SDfile   Computed 3D by Vconf -m prep SDfile
Find this compound or compounds like it in BindingDB:
Activity Spreadsheet -- Enzyme Inhibition Constant Data from BindingDB
Found 1 hit for monomerid = 81338
TargetCell division protein FtsZ(Aquifex aeolicus)
University Of Amsterdam
LigandPNGBDBM81338(PhGTP (10b))
Affinity DataIC50:  7.10E+4nMpH: 7.5Assay Description:The binding affinities to FtsZ were determined by a fluorescent competition assay with 2'/3'-O-(N-methyl-anthraniloyl)-guanosine-5'-triph...
In DepthDetails ArticlePubMed