BDBM83216 3-amino-4-(4-chlorophenyl)-6-(2-thienyl)thieno[2,3-b]pyridine-2-carbonitrile::3-amino-4-(4-chlorophenyl)-6-thiophen-2-yl-2-thieno[2,3-b]pyridinecarbonitrile::3-amino-4-(4-chlorophenyl)-6-thiophen-2-ylthieno[2,3-b]pyridine-2-carbonitrile::3-azanyl-4-(4-chlorophenyl)-6-thiophen-2-yl-thieno[2,3-b]pyridine-2-carbonitrile::MLS000324481::SMR000160398::cid_1005239
SMILES Nc1c(sc2nc(cc(-c3ccc(Cl)cc3)c12)-c1cccs1)C#N
InChI Key InChIKey=NXPLOWTYCPHLMP-UHFFFAOYSA-N
Data  2 IC50
  Tab Delimited (TSV)   2D SDfile   Computed 3D by Vconf -m prep SDfile
Find this compound or compounds like it in BindingDB:
Activity Spreadsheet -- Enzyme Inhibition Constant Data from BindingDB
Found 2 hits for monomerid = 83216
TargetBeta-lactamase(Pseudomonas aeruginosa)
The Scripps Research Institute Molecular Screening Center
Curated by PubChem BioAssay
LigandPNGBDBM83216(3-amino-4-(4-chlorophenyl)-6-(2-thienyl)thieno[2,3...)
Affinity DataIC50:  4.74E+3nM. Assay description: Source (MLPCN Center Name): The Scripps Research Institute Molecular Screening Center (SRIMSC) Affiliation: The Scripps Research Institute, TSRI Assa...
In DepthDetails PCBioAssay
TargetToll-like receptor 9(Homo sapiens (Human))
The Scripps Research Institute Molecular Screening Center
Curated by PubChem BioAssay
LigandPNGBDBM83216(3-amino-4-(4-chlorophenyl)-6-(2-thienyl)thieno[2,3...)
Affinity DataIC50:  6.32E+3nM. Assay description: Source (MLPCN Center Name): The Scripps Research Institute Molecular Screening Center (SRIMSC) Affiliation: The Scripps Research Institute, TSRI Assa...
In DepthDetails PCBioAssay