BDBM88581 1-(2,1,3-benzoxadiazol-4-ylsulfonyl)-N-(6-ethoxy-1,3-benzothiazol-2-yl)-3-piperidinecarboxamide::1-(2,1,3-benzoxadiazol-4-ylsulfonyl)-N-(6-ethoxy-1,3-benzothiazol-2-yl)piperidine-3-carboxamide::1-benzofurazan-4-ylsulfonyl-N-(6-ethoxy-1,3-benzothiazol-2-yl)nipecotamide::MLS000521743::SMR000132151::cid_9550171
SMILES CCOc1ccc2nc(NC(=O)C3CCCN(C3)S(=O)(=O)c3cccc4nonc34)sc2c1
InChI Key InChIKey=PUVRBNQNWNIJNA-UHFFFAOYSA-N
Data  1 IC50
  Tab Delimited (TSV)   2D SDfile   Computed 3D by Vconf -m prep SDfile
Find this compound or compounds like it in BindingDB:
Activity Spreadsheet -- Enzyme Inhibition Constant Data from BindingDB
Found 1 hit for monomerid = 88581
TargetMelanocortin receptor 4(Homo sapiens (Human))
The Scripps Research Institute Molecular Screening Center
Curated by PubChem BioAssay
LigandPNGBDBM88581(1-(2,1,3-benzoxadiazol-4-ylsulfonyl)-N-(6-ethoxy-1...)
Affinity DataIC50: >6.46E+4nM. Assay description: Source (MLPCN Center Name): The Scripps Research Institute Molecular Screening Center (SRISMC) Center Affiliation: The Scripps Research Institute, TS...
In DepthDetails PCBioAssay