BDBM88628 2-[(6-chloranyl-1,2,3,4-tetrahydroacridin-9-yl)sulfanyl]-N-(2-morpholin-4-ylethyl)ethanamide::2-[(6-chloro-1,2,3,4-tetrahydroacridin-9-yl)sulfanyl]-N-(2-morpholin-4-ylethyl)acetamide::2-[(6-chloro-1,2,3,4-tetrahydroacridin-9-yl)thio]-N-(2-morpholin-4-ylethyl)acetamide::2-[(6-chloro-1,2,3,4-tetrahydroacridin-9-yl)thio]-N-(2-morpholinoethyl)acetamide::2-[(6-chloro-1,2,3,4-tetrahydroacridin-9-yl)thio]-N-[2-(4-morpholinyl)ethyl]acetamide::MLS000731356::SMR000309631::cid_16193930
SMILES Clc1ccc2c(SCC(=O)NCCN3CCOCC3)c3CCCCc3nc2c1
InChI Key InChIKey=KIQHBMZYEZFPIQ-UHFFFAOYSA-N
Data  1 IC50
  Tab Delimited (TSV)   2D SDfile   Computed 3D by Vconf -m prep SDfile
Find this compound or compounds like it in BindingDB:
Activity Spreadsheet -- Enzyme Inhibition Constant Data from BindingDB
Found 1 hit for monomerid = 88628
TargetMelanocortin receptor 4(Homo sapiens (Human))
The Scripps Research Institute Molecular Screening Center
Curated by PubChem BioAssay
LigandPNGBDBM88628(2-[(6-chloranyl-1,2,3,4-tetrahydroacridin-9-yl)sul...)
Affinity DataIC50: >6.46E+4nM. Assay description: Source (MLPCN Center Name): The Scripps Research Institute Molecular Screening Center (SRISMC) Center Affiliation: The Scripps Research Institute, TS...
In DepthDetails PCBioAssay