BDBM94946 2-(2-fluorophenyl)-N-(3-morpholin-4-ylpropyl)quinazolin-4-amine::2-(2-fluorophenyl)-N-[3-(4-morpholinyl)propyl]-4-quinazolinamine::MLS000036511::SMR000037729::[2-(2-fluorophenyl)quinazolin-4-yl]-(3-morpholinopropyl)amine::cid_661646
SMILES Fc1ccccc1-c1nc(NCCCN2CCOCC2)c2ccccc2n1
InChI Key InChIKey=PIRZAMYJPZQUGW-UHFFFAOYSA-N
Data  3 IC50
  Tab Delimited (TSV)   2D SDfile   Computed 3D by Vconf -m prep SDfile
Find this compound or compounds like it in BindingDB:
Activity Spreadsheet -- Enzyme Inhibition Constant Data from BindingDB
Found 3 hits for monomerid = 94946
TargetLow molecular weight phosphotyrosine protein phosphatase(Homo sapiens (Human))
Burnham Center For Chemical Genomics
Curated by PubChem BioAssay
LigandPNGBDBM94946(2-(2-fluorophenyl)-N-(3-morpholin-4-ylpropyl)quina...)
Affinity DataIC50:  1.30E+4nM
In DepthDetails PCBioAssay
TargetTyrosine-protein phosphatase non-receptor type 22(Homo sapiens (Human))
Burnham Center For Chemical Genomics
Curated by PubChem BioAssay
LigandPNGBDBM94946(2-(2-fluorophenyl)-N-(3-morpholin-4-ylpropyl)quina...)
Affinity DataIC50: >8.00E+4nM
In DepthDetails PCBioAssay
TargetLow molecular weight phosphotyrosine protein phosphatase(Homo sapiens (Human))
Burnham Center For Chemical Genomics
Curated by PubChem BioAssay
LigandPNGBDBM94946(2-(2-fluorophenyl)-N-(3-morpholin-4-ylpropyl)quina...)
Affinity DataIC50:  3.30E+4nM
In DepthDetails PCBioAssay