Target
Amine oxidase [flavin-containing] A
Ligand
BDBM11022
Substrate
BDBM10990
Meas. Tech.
MAO Inhibition Assay
pH
7.5±n/a
Temperature
298.15±n/a K
Ki
15000±n/a nM
Citation
 Hubalek, FBinda, CKhalil, ALi, MMattevi, ACastagnoli, NEdmondson, DE Demonstration of isoleucine 199 as a structural determinant for the selective inhibition of human monoamine oxidase B by specific reversible inhibitors. J Biol Chem 280:15761-6 (2005)  
Target
Name:
Amine oxidase [flavin-containing] A
Synonyms:
AOFA_HUMAN MAO-A Monoamine oxidase Monoamine oxidase type A (MAO A) Monoamine oxidase type A (MAOA)
Type:
Protein
Mol. Mass.:
59689.53
Organism:
Homo sapiens (Human)
Description:
P21397
Residue:
527
  
Inhibitor
Name:
BDBM11022
Synonyms:
2,3-dihydro-1H-indole-2,3-dione Isatin | Isatin (Compound 1)
Type:
Small organic molecule
Emp. Form.:
C8H5NO2
Mol. Mass.:
147.1308
SMILES:
O=C1Nc2ccccc2C1=O
:
Substrate
Name:
BDBM10990
Synonyms:
3-amino-1-(2-aminophenyl)propan-1-one Kynuramine
Type:
Small organic molecule
Emp. Form.:
C9H12N2O
Mol. Mass.:
164.2044
SMILES:
NCCC(=O)c1ccccc1N
: