Target
E3 ubiquitin-protein ligase SMURF1
Ligand
BDBM239092
Substrate
Meas. Tech.
Pharmaceutical Assay
IC50
2.10±n/a nM
Citation
 Bala, KJBrearley, ADale, JEdwards, AAhmed, MPorter, DPulz, RARooney, LASandham, DAShaw, DSmith, NTaylor, JLTaylor, RJTroxler, TJWrigglesworth, J Carboxamide derivatives US Patent  US10195181 Publication Date 2/5/2019 
Target
Name:
E3 ubiquitin-protein ligase SMURF1
Synonyms:
E3 ubiquitin-protein ligase SMURF1 KIAA1625 SMAD-specific E3 ubiquitin-protein ligase 1 SMURF1 | hSMURF1
Type:
PROTEIN
Mol. Mass.:
86120.64
Organism:
Homo sapiens (Human)
Description:
ChEMBL_116984
Residue:
757
  
Inhibitor
Name:
BDBM239092
Synonyms:
US10195181, Example 1.1 | US9403810, 1.1
Type:
Small organic molecule
Emp. Form.:
C25H36N4O3
Mol. Mass.:
440.5783
SMILES:
CCC1CC(C)CC=C1c1onc(C(=O)Nc2c(C)n(C)n(C3CCCCC3)c2=O)c1C
: