Target
Coagulation factor X
Ligand
BDBM13894
Substrate
BDBM12500
Meas. Tech.
Factor Xa Inhibition Assay
Ki
82±n/a nM
Citation
 Matter, HDefossa, EHeinelt, UBlohm, PMSchneider, DMuller, AHerok, SSchreuder, HLiesum, ABrachvogel, VLonze, PWalser, AAl-Obeidi, FWildgoose, P Design and quantitative structure-activity relationship of 3-amidinobenzyl-1H-indole-2-carboxamides as potent, nonchiral, and selective inhibitors of blood coagulation factor Xa. J Med Chem 45:2749-69 (2002)  
Target
Name:
Coagulation factor X
Synonyms:
Activated coagulation factor X (FXa) Coagulation factor X precursor F10 Factor X heavy chain Factor Xa Stuart-Prower factor
Type:
Enzyme
Mol. Mass.:
54726.60
Organism:
Homo sapiens (Human)
Description:
Residue:
488
  
Inhibitor
Name:
BDBM13894
Synonyms:
2,2,2-trifluoroacetate; 4-({[5-(benzyloxy)-1-[(3-carbamimidoylphenyl)methyl]-1H-indol-2-yl]formamido}methyl)-N,N,N-trimethylanilinium | 3-amidinobenzylindole carboxamide 79
Type:
Small organic molecule
Emp. Form.:
C34H36N5O2
Mol. Mass.:
546.6814
SMILES:
C[N+](C)(C)c1ccc(CNC(=O)c2cc3cc(OCc4ccccc4)ccc3n2Cc2cccc(c2)C(N)=N)cc1
:
Substrate
Name:
BDBM12500
Synonyms:
Cbz-D-Arg-Gly-L-Arg-pNA N-a-Benzyloxycarbonyl-Darginyl-L-glycyl-L-arginine-pnitroaniline benzyl N-[(1R)-4-carbamimidamido-1-[({[(1S)-4-carbamimidamido-1-[(4-nitrophenyl)carbamoyl]butyl]carbamoyl}methyl)carbamoyl]butyl]carbamate
Type:
Small organic molecule
Emp. Form.:
C28H39N11O7
Mol. Mass.:
641.6788
SMILES:
[#7]\[#6](-[#7])=[#7]/[#6]-[#6]-[#6]-[#6@@H](-[#7]-[#6](=O)-[#8]-[#6]-c1ccccc1)-[#6](=O)-[#7]-[#6]-[#6](=O)-[#7]-[#6@@H](-[#6]-[#6]-[#6]-[#7+]=[#6](-[#7])-[#7-])-[#6](=O)-[#7]-c1ccc(cc1)-[#7+](-[#8-])=O
: