Target
Liver carboxylesterase 1
Ligand
BDBM22759
Substrate
BDBM22723
Meas. Tech.
Enzyme Inhibition Assay
Ki
8.0±n/a nM
Citation
 Hyatt, JLWadkins, RMTsurkan, LHicks, LDHatfield, MJEdwards, CCRoss, CRCantalupo, SACrundwell, GDanks, MKGuy, RKPotter, PM Planarity and constraint of the carbonyl groups in 1,2-diones are determinants for selective inhibition of human carboxylesterase 1. J Med Chem 50:5727-34 (2007)  
Target
Name:
Liver carboxylesterase 1
Synonyms:
Acyl coenzyme A:cholesterol acyltransferase CES1 EST1_HUMAN Serine hydrolase (CES1)
Type:
Protein
Mol. Mass.:
62520.83
Organism:
Homo sapiens (Human)
Description:
Residue:
567
  
Inhibitor
Name:
BDBM22759
Synonyms:
1-[4-(2-oxo-2-phenylacetyl)phenyl]-2-phenylethane-1,2-dione JMC505727 Compound 18
Type:
Small organic molecule
Emp. Form.:
C22H14O4
Mol. Mass.:
342.3442
SMILES:
O=C(C(=O)c1ccc(cc1)C(=O)C(=O)c1ccccc1)c1ccccc1
:
Substrate
Name:
BDBM22723
Synonyms:
2-nitrophenyl acetate o-NPA | o-nitrophenyl acetate
Type:
Small organic molecule
Emp. Form.:
C8H7NO4
Mol. Mass.:
181.1455
SMILES:
CC(=O)Oc1ccccc1[N+]([O-])=O
: