Target
Aminopeptidase N
Ligand
BDBM23990
Substrate
BDBM23972
Meas. Tech.
Enzyme Inhibition Assay
IC50
>1000000±n/a nM
Citation
 Albrecht, SDefoin, ASalomon, ETarnus, CWetterholm, AHaeggström, JZ Synthesis and structure activity relationships of novel non-peptidic metallo-aminopeptidase inhibitors. Bioorg Med Chem 14:7241-57 (2006)  
Target
Name:
Aminopeptidase N
Synonyms:
AMPN_PIG AP-M Alanyl aminopeptidase Aminopeptidase N (APN) Microsomal aminopeptidase pAPN
Type:
Protein
Mol. Mass.:
108810.25
Organism:
Sus scrofa (Pig)
Description:
P15145
Residue:
963
  
Inhibitor
Name:
BDBM23990
Synonyms:
3-amino-1,2,3,4-tetrahydroquinolin-2-one hydrochloride | aminoquinolinone, 5
Type:
Small organic molecule
Emp. Form.:
C9H10N2O
Mol. Mass.:
162.1885
SMILES:
NC1Cc2ccccc2NC1=O
:
Substrate
Name:
BDBM23972
Synonyms:
(2S)-2-amino-4-methyl-N-(4-nitrophenyl)pentanamide L-Leucine-para-nitroanilide
Type:
Emp. Form.:
C12H17N3O3
Mol. Mass.:
251.2817
SMILES:
CC(C)C[C@H](N)C(=O)Nc1ccc(cc1)[N+]([O-])=O
: