Target
Nociceptin receptor
Ligand
BDBM462395
Substrate
Meas. Tech.
Inhibitory Activity Assay
Ki
36.0±n/a nM
Citation
 Shoichet, BKLevit, AManglik, AKobilka, BGmeiner, PHübner, HDengler, DG Mu opioid receptor modulators US Patent  US10780078 Publication Date 9/22/2020 
Target
Name:
Nociceptin receptor
Synonyms:
KOR-3 Mu-type opioid receptor (Mu) Nociceptin Receptor (ORL1 Receptor) Nociceptin receptor (ORL-1) Nociceptin/Orphanin FQ, NOP receptor OPIATE ORL-1 OPRL1 protein ORL1 Opioid receptor like-1 Orphanin FQ receptor (ORL1) | P41146
Type:
G Protein-Coupled Receptor (GPCR)
Mol. Mass.:
40702.87
Organism:
Homo sapiens (Human)
Description:
P41146
Residue:
370
  
Inhibitor
Name:
BDBM462395
Synonyms:
US10780078, Compound DD 272B
Type:
Small organic molecule
Emp. Form.:
C21H29N3O2S
Mol. Mass.:
387.539
SMILES:
C[C@@H](Cc1ccsc1)NC(=O)NC[C@@]1(CCc2cc(O)ccc2C1)N(C)C
: