Target
Corticotropin-releasing factor receptor 1
Ligand
BDBM29497
Substrate
125I-Tyr(0)-ovine-CRF
Meas. Tech.
In Vitro Binding Autoradiography
pH
7.2±n/a
Temperature
296.15±n/a K
IC50
8.5±1.2 nM
Citation
 Gilligan, PJClarke, THe, LLelas, SLi, YWHeman, KFitzgerald, LMiller, KZhang, GMarshall, AKrause, CMcElroy, JFWard, KZeller, KWong, HBai, SSaye, JGrossman, SZaczek, RArneric, SPHartig, PRobertson, DTrainor, G Synthesis and structure-activity relationships of 8-(pyrid-3-yl)pyrazolo[1,5-a]-1,3,5-triazines: potent, orally bioavailable corticotropin releasing factor receptor-1 (CRF1) antagonists. J Med Chem 52:3084-92 (2009)  
Target
Name:
Corticotropin-releasing factor receptor 1
Synonyms:
CRF-R CRFR1_RAT Corticotropin releasing factor receptor Corticotropin-releasing Factor Receptor 1 Crhr | Crhr1
Type:
G Protein-Coupled Receptor (GPCR)
Mol. Mass.:
47870.75
Organism:
Rattus norvegicus (rat)
Description:
Receptor binding assays were performed using rat cortex homogenate.
Residue:
415
  
Inhibitor
Name:
BDBM29497
Synonyms:
Pyrazolo[1,5-a]-1,3,5-triazine, 13-22
Type:
Small organic molecule
Emp. Form.:
C20H28N6O3
Mol. Mass.:
400.4747
SMILES:
COCCN(CCOC)c1nc(C)nc2c(c(C)nn12)-c1ccc(OC)nc1C
:
Substrate
Name:
125I-Tyr(0)-ovine-CRF
Synonyms:
Ovine Tyr-CRF | oCRF
Type:
radiolabeled substrate
Mol. Mass.:
4833.46
Organism:
Ovis aries (sheep)
Description:
Residue:
42