Target
5-hydroxytryptamine receptor 1E
Ligand
BDBM31064
Substrate
Not Available
Meas. Tech.
Dose Response Cell Based Assay for Antagonists of the 5-Hydroxytryptamine Receptor Subtype 1E (5HT1E
pH
7.4±n/a
Temperature
296.15±n/a K
IC50
2257±n/a nM
Citation
 PubChem, PC Dose Response Cell Based Assay for Antagonists of the 5-Hydroxytryptamine Receptor Subtype 1E (5HT1E) PubChem Bioassay (2007)[AID] 
Target
Name:
5-hydroxytryptamine receptor 1E
Synonyms:
5-HT-1E 5-Hydroxytryptamine Receptor Subtype 1E (5HT1E) 5-hydroxytryptamine receptor 1E (5-HT-1E) (S31) 5HT1E_HUMAN S31 Serotonin 1e (5-HT1e) receptor | Serotonin Receptor 1E
Type:
G Protein-Coupled Receptor (GPCR)
Mol. Mass.:
41697.80
Organism:
Homo sapiens (Human)
Description:
gi_112822
Residue:
365
  
Inhibitor
Name:
BDBM31064
Synonyms:
4-(2-furanyl)-2-methylsulfonyl-6-(trifluoromethyl)pyrimidine 4-(2-furyl)-2-mesyl-6-(trifluoromethyl)pyrimidine MLS000044646 cid_3237865
Type:
Small organic molecule
Emp. Form.:
C10H7F3N2O3S
Mol. Mass.:
292.234
SMILES:
CS(=O)(=O)c1nc(cc(n1)C(F)(F)F)-c1ccco1
:
Substrate
Name:
Not Available
Synonyms:
Type:
Mol. Mass.:
358.43
Organism:
Description:
Residue:
3
NA