Target
Sliding-clamp-loader large/small subunit
Ligand
BDBM36312
Substrate
BDBM50118233
Meas. Tech.
colorimetric ATPase assay
pH
7.5±0
Temperature
298.15±0 K
Ki
2.89e+4± 1.16e+4 nM
Citation
 Eng, KScouten-Ponticelli, SKSutton, MBerdis, A Selective Inhibition of DNA Replicase Assembly by a Non-natural Nucleotide: Exploiting the Structural Diversity of ATP-Binding Sites ACS Chem Biol 5:183-94 (2010)  
Target
Name:
Sliding-clamp-loader large/small subunit
Synonyms:
ATP-dependent clamp loaders gp44/62
Type:
Mol. Mass.:
Description:
Components:
This complex has 2 components.
Component 1
Name:
Sliding-clamp-loader large subunit
Synonyms:
44 Gene product 44 Sliding-clamp-loader gp44 subunit | gp44
Type:
Mol. Mass.:
35788.87
Organism:
Enterobacteria phage T4 (Bacteriophage T4)
Description:
P04526
Residue:
319
  
Component 2
Name:
Sliding-clamp-loader small subunit
Synonyms:
62 Gene product 62 Sliding-clamp-loader gp44 subunit | gp62
Type:
Mol. Mass.:
21366.49
Organism:
Enterobacteria phage T4 (Bacteriophage T4)
Description:
P04527
Residue:
187
  
Inhibitor
Name:
BDBM36312
Synonyms:
ATP{gamma}S | adenosine 5'-O-(3-thiotriphosphate)
Type:
Small organic molecule
Emp. Form.:
C10H16N5O12P3S
Mol. Mass.:
523.247
SMILES:
[H][C@@]1(O)C(COP(O)(=O)OP(O)(=O)OP(O)(O)=S)OC(n2cnc3c(N)ncnc23)[C@]1([H])O
:
Substrate
Name:
BDBM50118233
Synonyms:
2'-deoxyadenosine 5'-(tetrahydrogen triphosphate) CHEMBL335538 | dATP
Type:
Small organic molecule
Emp. Form.:
C10H16N5O12P3
Mol. Mass.:
491.1816
SMILES:
Nc1ncnc2n(cnc12)[C@H]1C[C@H](O)[C@@H](COP(O)(=O)OP(O)(=O)OP(O)(O)=O)O1
: