Target
Complex of Sliding-clamp-loader large subunit [R175L] and Sliding-clamp-loader small subunit
Ligand
BDBM36312
Substrate
BDBM50118233
Meas. Tech.
colorimetric ATPase assay
pH
7.5±0
Temperature
298.15±0 K
Ki
3.32e+4± 8.0e+3 nM
Citation
 Eng, KScouten-Ponticelli, SKSutton, MBerdis, A Selective Inhibition of DNA Replicase Assembly by a Non-natural Nucleotide: Exploiting the Structural Diversity of ATP-Binding Sites ACS Chem Biol 5:183-94 (2010)  
Target
Name:
Complex of Sliding-clamp-loader large subunit [R175L] and Sliding-clamp-loader small subunit
Synonyms:
ATP-dependent clamp loaders gp44/62 (R175L)
Type:
PROTEIN
Mol. Mass.:
57093.31
Organism:
bacteriophage T4
Description:
Modified from ATP-dependent clamp loaders 44/62
Residue:
506
  
Inhibitor
Name:
BDBM36312
Synonyms:
ATP{gamma}S | adenosine 5'-O-(3-thiotriphosphate)
Type:
Small organic molecule
Emp. Form.:
C10H16N5O12P3S
Mol. Mass.:
523.247
SMILES:
[H][C@@]1(O)C(COP(O)(=O)OP(O)(=O)OP(O)(O)=S)OC(n2cnc3c(N)ncnc23)[C@]1([H])O
:
Substrate
Name:
BDBM50118233
Synonyms:
2'-deoxyadenosine 5'-(tetrahydrogen triphosphate) CHEMBL335538 | dATP
Type:
Small organic molecule
Emp. Form.:
C10H16N5O12P3
Mol. Mass.:
491.1816
SMILES:
Nc1ncnc2n(cnc12)[C@H]1C[C@H](O)[C@@H](COP(O)(=O)OP(O)(=O)OP(O)(O)=O)O1
: