Target
Coagulation factor XI
Ligand
BDBM32677
Substrate
Meas. Tech.
Factor XIa Dose Response Confirmation
IC50
>50000±0 nM
Citation
 PubChem, PC Factor XIa Dose Response Confirmation PubChem Bioassay (2008)[AID] 
Target
Name:
Coagulation factor XI
Synonyms:
Coagulation factor XIa Coagulation factor XIa light chain FA11_HUMAN Factor XIa PTA | Plasma thromboplastin antecedent
Type:
Enzyme
Mol. Mass.:
70130.58
Organism:
Homo sapiens (Human)
Description:
P03951
Residue:
625
  
Inhibitor
Name:
BDBM32677
Synonyms:
2-[(4-cyclopentyloxyphenyl)methylamino]-1-butanol;hydrochloride 2-[[4-(cyclopentoxy)benzyl]amino]butan-1-ol;hydrochloride MLS000548610 cid_9549115
Type:
Small organic molecule
Emp. Form.:
C16H25NO2
Mol. Mass.:
263.3752
SMILES:
CCC(CO)NCc1ccc(OC2CCCC2)cc1
: