Target
Coagulation factor XI
Ligand
BDBM32728
Substrate
Meas. Tech.
Factor XIa Dose Response Confirmation
IC50
>50000±0 nM
Citation
 PubChem, PC Factor XIa Dose Response Confirmation PubChem Bioassay (2008)[AID] 
Target
Name:
Coagulation factor XI
Synonyms:
Coagulation factor XIa Coagulation factor XIa light chain FA11_HUMAN Factor XIa PTA | Plasma thromboplastin antecedent
Type:
Enzyme
Mol. Mass.:
70130.58
Organism:
Homo sapiens (Human)
Description:
P03951
Residue:
625
  
Inhibitor
Name:
BDBM32728
Synonyms:
1-benzotriazolyl-[3-(3-methoxyphenyl)-1-phenyl-4-pyrazolyl]methanone MLS000536916 benzotriazol-1-yl-[3-(3-methoxyphenyl)-1-phenyl-pyrazol-4-yl]methanone cid_2140154
Type:
Small organic molecule
Emp. Form.:
C23H17N5O2
Mol. Mass.:
395.4134
SMILES:
COc1cccc(c1)-c1nn(cc1C(=O)n1nnc2ccccc12)-c1ccccc1
: