Target
Coagulation factor XI
Ligand
BDBM32742
Substrate
Meas. Tech.
Factor XIa Dose Response Confirmation
IC50
>50000±0 nM
Citation
 PubChem, PC Factor XIa Dose Response Confirmation PubChem Bioassay (2008)[AID] 
Target
Name:
Coagulation factor XI
Synonyms:
Coagulation factor XIa Coagulation factor XIa light chain FA11_HUMAN Factor XIa PTA | Plasma thromboplastin antecedent
Type:
Enzyme
Mol. Mass.:
70130.58
Organism:
Homo sapiens (Human)
Description:
P03951
Residue:
625
  
Inhibitor
Name:
BDBM32742
Synonyms:
1-(3-Hydroxy-propyl)-2-phenyl-5,6,7,8-tetrahydro-1H-quinazoline-4-thione 1-(3-oxidanylpropyl)-2-phenyl-5,6,7,8-tetrahydroquinazoline-4-thione SMR000148831 | cid_1556792
Type:
Small organic molecule
Emp. Form.:
C17H20N2OS
Mol. Mass.:
300.418
SMILES:
OCCCn1c2CCCCc2c(=S)nc1-c1ccccc1
: