Target
Coagulation factor XI
Ligand
BDBM32749
Substrate
Meas. Tech.
Factor XIa Dose Response Confirmation
IC50
>50000±0 nM
Citation
 PubChem, PC Factor XIa Dose Response Confirmation PubChem Bioassay (2008)[AID] 
Target
Name:
Coagulation factor XI
Synonyms:
Coagulation factor XIa Coagulation factor XIa light chain FA11_HUMAN Factor XIa PTA | Plasma thromboplastin antecedent
Type:
Enzyme
Mol. Mass.:
70130.58
Organism:
Homo sapiens (Human)
Description:
P03951
Residue:
625
  
Inhibitor
Name:
BDBM32749
Synonyms:
MLS000536748 N-[keto-(4-nitrophenoxy)-phenyl-persulfuranylidene]carbamic acid ethyl ester cid_2305429 ethyl N-[(4-nitrophenoxy)-oxo-phenyl--sulfanylidene]carbamate
Type:
Small organic molecule
Emp. Form.:
C15H14N2O6S
Mol. Mass.:
350.346
SMILES:
CCOC(=O)N=S(=O)(Oc1ccc(cc1)[N+]([O-])=O)c1ccccc1
: