Target
Ubiquitin carboxyl-terminal hydrolase BAP1
Ligand
BDBM40266
Substrate
Meas. Tech.
BAP1 Enzyme inhibitors Dose Response Confirmation
IC50
18282.8±n/a nM
Citation
 PubChem, PC BAP1 Enzyme inhibitors Dose Response Confirmation PubChem Bioassay (2007)[AID] 
Target
Name:
Ubiquitin carboxyl-terminal hydrolase BAP1
Synonyms:
BAP1 KIAA0272 | Ubiquitin carboxyl-terminal hydrolase BAP1 (BRCA1-associated protein 1) (Cerebral protein 6).
Type:
Enzyme Catalytic Domain
Mol. Mass.:
80364.15
Organism:
Homo sapiens (Human)
Description:
gi_68565074
Residue:
729
  
Inhibitor
Name:
BDBM40266
Synonyms:
1-[1-(3-piperidin-1-ylsulfonylphenyl)sulfonylpiperidin-4-yl]benzotriazole 1-[1-[3-(1-piperidinylsulfonyl)phenyl]sulfonyl-4-piperidinyl]benzotriazole MLS000033591 cid_644899
Type:
Small organic molecule
Emp. Form.:
C22H27N5O4S2
Mol. Mass.:
489.611
SMILES:
O=S(=O)(N1CCCCC1)c1cccc(c1)S(=O)(=O)N1CCC(CC1)n1nnc2ccccc12
: