Target
Ubiquitin carboxyl-terminal hydrolase BAP1
Ligand
BDBM40271
Substrate
Meas. Tech.
BAP1 Enzyme inhibitors Dose Response Confirmation
IC50
>50000±n/a nM
Citation
 PubChem, PC BAP1 Enzyme inhibitors Dose Response Confirmation PubChem Bioassay (2007)[AID] 
Target
Name:
Ubiquitin carboxyl-terminal hydrolase BAP1
Synonyms:
BAP1 KIAA0272 | Ubiquitin carboxyl-terminal hydrolase BAP1 (BRCA1-associated protein 1) (Cerebral protein 6).
Type:
Enzyme Catalytic Domain
Mol. Mass.:
80364.15
Organism:
Homo sapiens (Human)
Description:
gi_68565074
Residue:
729
  
Inhibitor
Name:
BDBM40271
Synonyms:
MLS000071074 N-(3-cyano-4,5-dimethyl-2-thienyl)-2-[(5-keto-6-methyl-2H-1,2,4-triazin-3-yl)thio]acetamide N-(3-cyano-4,5-dimethyl-thiophen-2-yl)-2-[(6-methyl-5-oxidanylidene-2H-1,2,4-triazin-3-yl)sulfanyl]ethanamide SMR000003303 | cid_648086
Type:
Small organic molecule
Emp. Form.:
C13H13N5O2S2
Mol. Mass.:
335.405
SMILES:
Cc1sc(NC(=O)CSc2nnc(C)c(=O)[nH]2)c(C#N)c1C
: