Target
Ubiquitin carboxyl-terminal hydrolase BAP1
Ligand
BDBM40293
Substrate
Meas. Tech.
BAP1 Enzyme inhibitors Dose Response Confirmation
IC50
>50000±n/a nM
Citation
 PubChem, PC BAP1 Enzyme inhibitors Dose Response Confirmation PubChem Bioassay (2007)[AID] 
Target
Name:
Ubiquitin carboxyl-terminal hydrolase BAP1
Synonyms:
BAP1 KIAA0272 | Ubiquitin carboxyl-terminal hydrolase BAP1 (BRCA1-associated protein 1) (Cerebral protein 6).
Type:
Enzyme Catalytic Domain
Mol. Mass.:
80364.15
Organism:
Homo sapiens (Human)
Description:
gi_68565074
Residue:
729
  
Inhibitor
Name:
BDBM40293
Synonyms:
1-(2,1,3-benzothiadiazol-4-ylsulfonyl)-4-(4-bromophenyl)-1H-pyrazol-3-amine 1-(2,1,3-benzothiadiazol-4-ylsulfonyl)-4-(4-bromophenyl)pyrazol-3-amine SMR000082517 cid_1258047
Type:
Small organic molecule
Emp. Form.:
C15H10BrN5O2S2
Mol. Mass.:
436.306
SMILES:
Nc1nn(cc1-c1ccc(Br)cc1)S(=O)(=O)c1cccc2nsnc12
: