Target
Myeloperoxidase
Ligand
BDBM312171
Substrate
Meas. Tech.
Pharmacological Activity Assay
IC50
7.00±n/a nM
Citation
 Inghardt, TBJohannesson, PJurva, UMichaelsson, ELindstedt-Alstermark, ETomkinson, NStonehouse, JPGan, L 1-[2-(aminomethyl)benzyl]-2-thioxo-1,2,3,5-tetrahydro-4H-pyrrolo[3,2-d]pyrimidin-4-ones as inhibitors of myeloperoxidase US Patent  US10016430 Publication Date 7/10/2018 
Target
Name:
Myeloperoxidase
Synonyms:
84 kDa myeloperoxidase MPO Myeloperoxidase Myeloperoxidase heavy chain PERM_HUMAN
Type:
Enzyme
Mol. Mass.:
83888.32
Organism:
Homo sapiens (Human)
Description:
P05164
Residue:
745
  
Inhibitor
Name:
BDBM312171
Synonyms:
1-[2-(1-Aminoethyl)-4-chlorobenzyl]-2-thioxo-1,2,3,5-tetrahydro-4H-pyrrolo[3,2-d]pyrimidin-4-one US11000525, Example 2 | US9616063, 2
Type:
Small organic molecule
Emp. Form.:
C15H15ClN4OS
Mol. Mass.:
334.824
SMILES:
CC(N)c1cc(Cl)ccc1Cn1c2cc[nH]c2c(=O)[nH]c1=S
: