Target
Tyrosine-protein kinase JAK2
Ligand
BDBM43362
Substrate
Meas. Tech.
Luminescent counterscreen for inhibitors of the Janus kinase 2 mutant JAK2V617F: dose response cell-based high throughput screening assay for inhibitors of parental Ba/F3 cell viability.
IC50
223±n/a nM
Citation
 PubChem, PC Luminescent counterscreen for inhibitors of the Janus kinase 2 mutant JAK2V617F: dose response cell-based high throughput screening assay for inhibitors of parental Ba/F3 cell viability. PubChem Bioassay (2009)[AID] 
Target
Name:
Tyrosine-protein kinase JAK2
Synonyms:
JAK-2 JAK2_HUMAN Janus kinase 2 (JAK2) | Janus kinase 2 (a protein tyrosine kinase)
Type:
Protein
Mol. Mass.:
130684.68
Organism:
Homo sapiens (Human)
Description:
O60674
Residue:
1132
  
Inhibitor
Name:
BDBM43362
Synonyms:
MLS000069752 N,N-dimethylcarbamodithioic acid [[dimethylamino(sulfanylidene)methyl]thio] ester TETRAMETHYLTHIURAM DISULFIDE dimethylcarbamothioylsulfanyl N,N-dimethylcarbamodithioate
Type:
Small organic molecule
Emp. Form.:
C6H12N2S4
Mol. Mass.:
240.433
SMILES:
CN(C)C(=S)SSC(=S)N(C)C
: