Target
Tyrosine-protein kinase JAK2
Ligand
BDBM47408
Substrate
Meas. Tech.
Luminescent counterscreen for inhibitors of the Janus kinase 2 mutant JAK2V617F: dose response cell-based high throughput screening assay for inhibitors of parental Ba/F3 cell viability.
IC50
3676±n/a nM
Citation
 PubChem, PC Luminescent counterscreen for inhibitors of the Janus kinase 2 mutant JAK2V617F: dose response cell-based high throughput screening assay for inhibitors of parental Ba/F3 cell viability. PubChem Bioassay (2009)[AID] 
Target
Name:
Tyrosine-protein kinase JAK2
Synonyms:
JAK-2 JAK2_HUMAN Janus kinase 2 (JAK2) | Janus kinase 2 (a protein tyrosine kinase)
Type:
Protein
Mol. Mass.:
130684.68
Organism:
Homo sapiens (Human)
Description:
O60674
Residue:
1132
  
Inhibitor
Name:
BDBM47408
Synonyms:
2-(5-bromanyl-2-methyl-4-nitro-imidazol-1-yl)-1-naphthalen-2-yl-ethanone 2-(5-bromo-2-methyl-4-nitro-imidazol-1-yl)-1-(2-naphthyl)ethanone MLS000520163 cid_9550892
Type:
Small organic molecule
Emp. Form.:
C16H12BrN3O3
Mol. Mass.:
374.189
SMILES:
Cc1nc(c(Br)n1CC(=O)c1ccc2ccccc2c1)[N+]([O-])=O
: