Target
Tyrosine-protein kinase JAK2
Ligand
BDBM47425
Substrate
Meas. Tech.
Luminescent counterscreen for inhibitors of the Janus kinase 2 mutant JAK2V617F: dose response cell-based high throughput screening assay for inhibitors of parental Ba/F3 cell viability.
IC50
10610±n/a nM
Citation
 PubChem, PC Luminescent counterscreen for inhibitors of the Janus kinase 2 mutant JAK2V617F: dose response cell-based high throughput screening assay for inhibitors of parental Ba/F3 cell viability. PubChem Bioassay (2009)[AID] 
Target
Name:
Tyrosine-protein kinase JAK2
Synonyms:
JAK-2 JAK2_HUMAN Janus kinase 2 (JAK2) | Janus kinase 2 (a protein tyrosine kinase)
Type:
Protein
Mol. Mass.:
130684.68
Organism:
Homo sapiens (Human)
Description:
O60674
Residue:
1132
  
Inhibitor
Name:
BDBM47425
Synonyms:
2-chloranyl-N-[(2,3-dimethylcyclohexyl)carbamoyl]ethanamide 2-chloro-N-[[(2,3-dimethylcyclohexyl)amino]-oxomethyl]acetamide SMR000260491 | cid_5010280
Type:
Small organic molecule
Emp. Form.:
C11H19ClN2O2
Mol. Mass.:
246.734
SMILES:
CC1CCCC(NC(=O)NC(=O)CCl)C1C
: