Target
Tyrosine-protein kinase JAK2
Ligand
BDBM47430
Substrate
Meas. Tech.
Luminescent counterscreen for inhibitors of the Janus kinase 2 mutant JAK2V617F: dose response cell-based high throughput screening assay for inhibitors of parental Ba/F3 cell viability.
IC50
10990±n/a nM
Citation
 PubChem, PC Luminescent counterscreen for inhibitors of the Janus kinase 2 mutant JAK2V617F: dose response cell-based high throughput screening assay for inhibitors of parental Ba/F3 cell viability. PubChem Bioassay (2009)[AID] 
Target
Name:
Tyrosine-protein kinase JAK2
Synonyms:
JAK-2 JAK2_HUMAN Janus kinase 2 (JAK2) | Janus kinase 2 (a protein tyrosine kinase)
Type:
Protein
Mol. Mass.:
130684.68
Organism:
Homo sapiens (Human)
Description:
O60674
Residue:
1132
  
Inhibitor
Name:
BDBM47430
Synonyms:
(5Z)-3-anilino-5-(3,4-dihydroxybenzylidene)-2-thioxo-1,3-thiazolidin-4-one (5Z)-3-anilino-5-[(3,4-dihydroxyphenyl)methylidene]-2-sulfanylidene-1,3-thiazolidin-4-one (5Z)-5-[[3,4-bis(oxidanyl)phenyl]methylidene]-3-phenylazanyl-2-sulfanylidene-1,3-thiazolidin-4-one SMR000312614 | cid_1630995
Type:
Small organic molecule
Emp. Form.:
C16H12N2O3S2
Mol. Mass.:
344.408
SMILES:
Oc1ccc(\C=C2/SC(=S)N(Nc3ccccc3)C2=O)cc1O
: