Target
Tyrosine-protein kinase JAK2
Ligand
BDBM47470
Substrate
Meas. Tech.
Luminescent counterscreen for inhibitors of the Janus kinase 2 mutant JAK2V617F: dose response cell-based high throughput screening assay for inhibitors of parental Ba/F3 cell viability.
IC50
6871±n/a nM
Citation
 PubChem, PC Luminescent counterscreen for inhibitors of the Janus kinase 2 mutant JAK2V617F: dose response cell-based high throughput screening assay for inhibitors of parental Ba/F3 cell viability. PubChem Bioassay (2009)[AID] 
Target
Name:
Tyrosine-protein kinase JAK2
Synonyms:
JAK-2 JAK2_HUMAN Janus kinase 2 (JAK2) | Janus kinase 2 (a protein tyrosine kinase)
Type:
Protein
Mol. Mass.:
130684.68
Organism:
Homo sapiens (Human)
Description:
O60674
Residue:
1132
  
Inhibitor
Name:
BDBM47470
Synonyms:
5-fluoranyl-2,4-bis(oxidanylidene)-1H-pyrimidine-6-carboxylic acid 5-fluoro-2,4-dioxo-1H-pyrimidine-6-carboxylic acid SMR000393806 | cid_69711
Type:
Small organic molecule
Emp. Form.:
C5H3FN2O4
Mol. Mass.:
174.0867
SMILES:
OC(=O)c1[nH]c(=O)[nH]c(=O)c1F
: