Target
Heat shock protein HSP 90-alpha
Ligand
BDBM47932
Substrate
Meas. Tech.
Luminescence-based dose response biochemical high throughput screening assay for inhibitors of the Heat Shock Protein 90 (HSP90)
IC50
16748±n/a nM
Citation
 PubChem, PC Luminescence-based dose response biochemical high throughput screening assay for inhibitors of the Heat Shock Protein 90 (HSP90) PubChem Bioassay (2009)[AID] 
Target
Name:
Heat shock protein HSP 90-alpha
Synonyms:
HS90A_HUMAN HSP86 HSP90AA1 HSPCA Heat shock 86 kDa Heat shock protein HSP 90-alpha (HSP90) LAP-2 Lipopolysaccharide-associated protein 2 heat shock protein 90kDa alpha (cytosolic), class A member 1 isoform 2
Type:
Molecular Chaperone
Mol. Mass.:
84623.45
Organism:
Homo sapiens (Human)
Description:
P07900
Residue:
732
  
Inhibitor
Name:
BDBM47932
Synonyms:
2-(methoxycarbonylamino)ethyl N-(4-bromophenyl)-N-hydroxycarbamate 2-[(methoxycarbonyl)amino]ethyl 4-bromophenyl(hydroxy)carbamate N-(4-bromophenyl)-N-hydroxy-carbamic acid 2-(carbomethoxyamino)ethyl ester SMR000023902 | cid_3240634
Type:
Small organic molecule
Emp. Form.:
C11H13BrN2O5
Mol. Mass.:
333.135
SMILES:
COC(=O)NCCOC(=O)N(O)c1ccc(Br)cc1
: