Target
Heat shock protein HSP 90-alpha
Ligand
BDBM47970
Substrate
Meas. Tech.
Luminescence-based dose response biochemical high throughput screening assay for inhibitors of the Heat Shock Protein 90 (HSP90)
IC50
1961±n/a nM
Citation
 PubChem, PC Luminescence-based dose response biochemical high throughput screening assay for inhibitors of the Heat Shock Protein 90 (HSP90) PubChem Bioassay (2009)[AID] 
Target
Name:
Heat shock protein HSP 90-alpha
Synonyms:
HS90A_HUMAN HSP86 HSP90AA1 HSPCA Heat shock 86 kDa Heat shock protein HSP 90-alpha (HSP90) LAP-2 Lipopolysaccharide-associated protein 2 heat shock protein 90kDa alpha (cytosolic), class A member 1 isoform 2
Type:
Molecular Chaperone
Mol. Mass.:
84623.45
Organism:
Homo sapiens (Human)
Description:
P07900
Residue:
732
  
Inhibitor
Name:
BDBM47970
Synonyms:
MLS001017288 N-(4-methoxyphenyl)-N-[(3-oxo-1-benzothiophen-2-ylidene)amino]acetamide SMR000353492 | cid_2329474
Type:
Small organic molecule
Emp. Form.:
C17H14N2O3S
Mol. Mass.:
326.37
SMILES:
COc1ccc(cc1)N(N=C1Sc2ccccc2C1=O)C(C)=O
: