Target
Heat shock protein HSP 90-alpha
Ligand
BDBM47972
Substrate
Meas. Tech.
Luminescence-based dose response biochemical high throughput screening assay for inhibitors of the Heat Shock Protein 90 (HSP90)
IC50
6625±n/a nM
Citation
 PubChem, PC Luminescence-based dose response biochemical high throughput screening assay for inhibitors of the Heat Shock Protein 90 (HSP90) PubChem Bioassay (2009)[AID] 
Target
Name:
Heat shock protein HSP 90-alpha
Synonyms:
HS90A_HUMAN HSP86 HSP90AA1 HSPCA Heat shock 86 kDa Heat shock protein HSP 90-alpha (HSP90) LAP-2 Lipopolysaccharide-associated protein 2 heat shock protein 90kDa alpha (cytosolic), class A member 1 isoform 2
Type:
Molecular Chaperone
Mol. Mass.:
84623.45
Organism:
Homo sapiens (Human)
Description:
P07900
Residue:
732
  
Inhibitor
Name:
BDBM47972
Synonyms:
(4-anilinophenyl) acetate MLS001002014 acetic acid (4-anilinophenyl) ester | cid_2337865
Type:
Small organic molecule
Emp. Form.:
C14H13NO2
Mol. Mass.:
227.2585
SMILES:
CC(=O)Oc1ccc(Nc2ccccc2)cc1
: