Target
Heat shock protein HSP 90-alpha
Ligand
BDBM47984
Substrate
Meas. Tech.
Luminescence-based dose response biochemical high throughput screening assay for inhibitors of the Heat Shock Protein 90 (HSP90)
IC50
2288±n/a nM
Citation
 PubChem, PC Luminescence-based dose response biochemical high throughput screening assay for inhibitors of the Heat Shock Protein 90 (HSP90) PubChem Bioassay (2009)[AID] 
Target
Name:
Heat shock protein HSP 90-alpha
Synonyms:
HS90A_HUMAN HSP86 HSP90AA1 HSPCA Heat shock 86 kDa Heat shock protein HSP 90-alpha (HSP90) LAP-2 Lipopolysaccharide-associated protein 2 heat shock protein 90kDa alpha (cytosolic), class A member 1 isoform 2
Type:
Molecular Chaperone
Mol. Mass.:
84623.45
Organism:
Homo sapiens (Human)
Description:
P07900
Residue:
732
  
Inhibitor
Name:
BDBM47984
Synonyms:
5-(4-sec-Butyl-phenoxymethyl)-furan-2-carboxylic acid methyl ester 5-[(4-sec-butylphenoxy)methyl]furan-2-carboxylic acid methyl ester SMR000431240 methyl 5-[(4-butan-2-ylphenoxy)methyl]furan-2-carboxylate
Type:
Small organic molecule
Emp. Form.:
C17H20O4
Mol. Mass.:
288.3383
SMILES:
CCC(C)c1ccc(OCc2ccc(o2)C(=O)OC)cc1
: