Target
Heat shock protein HSP 90-alpha
Ligand
BDBM47987
Substrate
Meas. Tech.
Luminescence-based dose response biochemical high throughput screening assay for inhibitors of the Heat Shock Protein 90 (HSP90)
IC50
5721±n/a nM
Citation
 PubChem, PC Luminescence-based dose response biochemical high throughput screening assay for inhibitors of the Heat Shock Protein 90 (HSP90) PubChem Bioassay (2009)[AID] 
Target
Name:
Heat shock protein HSP 90-alpha
Synonyms:
HS90A_HUMAN HSP86 HSP90AA1 HSPCA Heat shock 86 kDa Heat shock protein HSP 90-alpha (HSP90) LAP-2 Lipopolysaccharide-associated protein 2 heat shock protein 90kDa alpha (cytosolic), class A member 1 isoform 2
Type:
Molecular Chaperone
Mol. Mass.:
84623.45
Organism:
Homo sapiens (Human)
Description:
P07900
Residue:
732
  
Inhibitor
Name:
BDBM47987
Synonyms:
2-chloranyl-5-[2-(pyridin-3-ylmethylidene)hydrazinyl]benzoic acid 2-chloro-5-[2-(pyridin-3-ylmethylidene)hydrazinyl]benzoic acid MLS000775196 cid_3483439
Type:
Small organic molecule
Emp. Form.:
C13H10ClN3O2
Mol. Mass.:
275.69
SMILES:
OC(=O)c1cc(ccc1Cl)N=NCc1cccnc1
: