Target
Heat shock protein HSP 90-alpha
Ligand
BDBM48029
Substrate
Meas. Tech.
Luminescence-based dose response biochemical high throughput screening assay for inhibitors of the Heat Shock Protein 90 (HSP90)
IC50
1261±n/a nM
Citation
 PubChem, PC Luminescence-based dose response biochemical high throughput screening assay for inhibitors of the Heat Shock Protein 90 (HSP90) PubChem Bioassay (2009)[AID] 
Target
Name:
Heat shock protein HSP 90-alpha
Synonyms:
HS90A_HUMAN HSP86 HSP90AA1 HSPCA Heat shock 86 kDa Heat shock protein HSP 90-alpha (HSP90) LAP-2 Lipopolysaccharide-associated protein 2 heat shock protein 90kDa alpha (cytosolic), class A member 1 isoform 2
Type:
Molecular Chaperone
Mol. Mass.:
84623.45
Organism:
Homo sapiens (Human)
Description:
P07900
Residue:
732
  
Inhibitor
Name:
BDBM48029
Synonyms:
4-[(E)-[3-(2-carbomethoxyanilino)-4-keto-1-naphthylidene]amino]sulfonylbenzoic acid 4-[(E)-[3-(2-methoxycarbonylanilino)-4-oxonaphthalen-1-ylidene]amino]sulfonylbenzoic acid MLS000948142 cid_6035171
Type:
Small organic molecule
Emp. Form.:
C25H18N2O7S
Mol. Mass.:
490.485
SMILES:
COC(=O)c1ccccc1NC1=CC(=NS(=O)(=O)c2ccc(cc2)C(O)=O)c2ccccc2C1=O
: