Target
ATP-dependent molecular chaperone HSP82
Ligand
BDBM38968
Substrate
Meas. Tech.
Luminesence Cell-Based Secondary Assay to Identify Inhibitors of Hsp90
EC50
22239±1672 nM
Citation
 PubChem, PC Luminesence Cell-Based Secondary Assay to Identify Inhibitors of Hsp90 PubChem Bioassay (2010)[AID] 
Target
Name:
ATP-dependent molecular chaperone HSP82
Synonyms:
heat shock protein 90
Type:
Enzyme Catalytic Domain
Mol. Mass.:
80784.12
Organism:
Candida albicans
Description:
gi_994798
Residue:
707
  
Inhibitor
Name:
BDBM38968
Synonyms:
MLS000086346 N-[5-(5-chloro-2-thienyl)-1,3,4-oxadiazol-2-yl]-4-(4,4-dimethyloxazolidin-3-yl)sulfonyl-benzamide N-[5-(5-chlorothien-2-yl)-1,3,4-oxadiazol-2-yl]-4-[(4,4-dimethyl-1,3-oxazolidin-3-yl)sulfonyl]benzamide SMR000021848 | cid_2159039
Type:
Small organic molecule
Emp. Form.:
C18H17ClN4O5S2
Mol. Mass.:
468.934
SMILES:
CC1(C)COCN1S(=O)(=O)c1ccc(cc1)C(=O)Nc1nnc(o1)-c1ccc(Cl)s1
: