Target
Trans-activator protein BZLF1
Ligand
BDBM50090505
Substrate
Meas. Tech.
Counterscreen for inhibitors of PP1: fluorescence-based biochemical high throughput dose response assay to identify inhibitors of Protein Phosphatase 5 (PP5)
IC50
239.16±n/a nM
Citation
 PubChem, PC Counterscreen for inhibitors of PP1: fluorescence-based biochemical high throughput dose response assay to identify inhibitors of Protein Phosphatase 5 (PP5) PubChem Bioassay (2010)[AID] 
Target
Name:
Trans-activator protein BZLF1
Synonyms:
BZLF1 PPP5C protein
Type:
Enzyme Catalytic Domain
Mol. Mass.:
26856.37
Organism:
Human herpesvirus 4
Description:
gi_82503229
Residue:
245
  
Inhibitor
Name:
BDBM50090505
Synonyms:
(1R,2S,6R,7S)-2,6-Dimethyl-4,10-dioxa-tricyclo[5.2.1.0*2,6*]decane-3,5-dione (1S,2R,6S,7R)-2,6-Dimethyl-4,10-dioxa-tricyclo[5.2.1.0*2,6*]decane-3,5-dione CANTHARIDIN cid_6708701
Type:
Small organic molecule
Emp. Form.:
C10H12O4
Mol. Mass.:
196.1999
SMILES:
C[C@]12[C@@H]3CC[C@@H](O3)[C@@]1(C)C(=O)OC2=O
: