Target
ATP-dependent molecular chaperone HSP82
Ligand
BDBM64872
Substrate
Meas. Tech.
Fluorescence Cell-Based Secondary Assay to Identify Inhibitors of Resistant C. albicans Growth in the Presence of Fluconazole
EC50
>160000±0 nM
Citation
 PubChem, PC Fluorescence Cell-Based Secondary Assay to Identify Inhibitors of Resistant C. albicans Growth in the Presence of Fluconazole PubChem Bioassay (2010)[AID] 
Target
Name:
ATP-dependent molecular chaperone HSP82
Synonyms:
heat shock protein 90
Type:
Enzyme Catalytic Domain
Mol. Mass.:
80784.12
Organism:
Candida albicans
Description:
gi_994798
Residue:
707
  
Inhibitor
Name:
BDBM64872
Synonyms:
1-(4-fluorophenyl)-3-[1-[(1-piperonyltetrazol-5-yl)methyl]-4-piperidyl]urea 1-[1-[[1-(1,3-benzodioxol-5-ylmethyl)-1,2,3,4-tetrazol-5-yl]methyl]piperidin-4-yl]-3-(4-fluorophenyl)urea 1-[1-[[1-(1,3-benzodioxol-5-ylmethyl)tetrazol-5-yl]methyl]piperidin-4-yl]-3-(4-fluorophenyl)urea SMR000006753 | cid_644508
Type:
Small organic molecule
Emp. Form.:
C22H24FN7O3
Mol. Mass.:
453.4695
SMILES:
Fc1ccc(NC(=O)NC2CCN(Cc3nnnn3Cc3ccc4OCOc4c3)CC2)cc1
: