Target
ATP-dependent molecular chaperone HSP82
Ligand
BDBM64905
Substrate
Meas. Tech.
Fluorescence Cell-Based Secondary Assay to Identify Inhibitors of Resistant C. albicans Growth in the Presence of Fluconazole
EC50
2006±1193 nM
Citation
 PubChem, PC Fluorescence Cell-Based Secondary Assay to Identify Inhibitors of Resistant C. albicans Growth in the Presence of Fluconazole PubChem Bioassay (2010)[AID] 
Target
Name:
ATP-dependent molecular chaperone HSP82
Synonyms:
heat shock protein 90
Type:
Enzyme Catalytic Domain
Mol. Mass.:
80784.12
Organism:
Candida albicans
Description:
gi_994798
Residue:
707
  
Inhibitor
Name:
BDBM64905
Synonyms:
2-[5-[(4-bromobenzyl)thio]-4-(2-furfuryl)-1,2,4-triazol-3-yl]pyrazine 2-[5-[(4-bromophenyl)methylthio]-4-(2-furanylmethyl)-1,2,4-triazol-3-yl]pyrazine SMR000036133 | cid_663136
Type:
Small organic molecule
Emp. Form.:
C18H14BrN5OS
Mol. Mass.:
428.306
SMILES:
Brc1ccc(CSc2nnc(-c3cnccn3)n2Cc2ccco2)cc1
: