Target
ATP-dependent molecular chaperone HSP82
Ligand
BDBM64911
Substrate
Meas. Tech.
Fluorescence Cell-Based Secondary Assay to Identify Inhibitors of Resistant C. albicans Growth in the Presence of Fluconazole
EC50
>150000±0 nM
Citation
 PubChem, PC Fluorescence Cell-Based Secondary Assay to Identify Inhibitors of Resistant C. albicans Growth in the Presence of Fluconazole PubChem Bioassay (2010)[AID] 
Target
Name:
ATP-dependent molecular chaperone HSP82
Synonyms:
heat shock protein 90
Type:
Enzyme Catalytic Domain
Mol. Mass.:
80784.12
Organism:
Candida albicans
Description:
gi_994798
Residue:
707
  
Inhibitor
Name:
BDBM64911
Synonyms:
4-[(7-butyl-1,3-dimethyl-2,6-dioxo-8-purinyl)methyl]-1-piperazinecarboxylic acid ethyl ester MLS000039617 cid_666088 ethyl 4-[[7-butyl-1,3-dimethyl-2,6-bis(oxidanylidene)purin-8-yl]methyl]piperazine-1-carboxylate
Type:
Small organic molecule
Emp. Form.:
C19H30N6O4
Mol. Mass.:
406.4793
SMILES:
CCCCn1c(CN2CCN(CC2)C(=O)OCC)nc2n(C)c(=O)n(C)c(=O)c12
: