Target
ATP-dependent molecular chaperone HSP82
Ligand
BDBM34593
Substrate
Meas. Tech.
Fluorescence Cell-Based Secondary Assay to Identify Inhibitors of Resistant C. albicans Growth in the Presence of Fluconazole
EC50
4862±1318 nM
Citation
 PubChem, PC Fluorescence Cell-Based Secondary Assay to Identify Inhibitors of Resistant C. albicans Growth in the Presence of Fluconazole PubChem Bioassay (2010)[AID] 
Target
Name:
ATP-dependent molecular chaperone HSP82
Synonyms:
heat shock protein 90
Type:
Enzyme Catalytic Domain
Mol. Mass.:
80784.12
Organism:
Candida albicans
Description:
gi_994798
Residue:
707
  
Inhibitor
Name:
BDBM34593
Synonyms:
7-[4-morpholinyl(2-pyridinyl)methyl]-8-quinolinol 7-[morpholino(2-pyridyl)methyl]quinolin-8-ol SMR000060863 | cid_2999043
Type:
Small organic molecule
Emp. Form.:
C19H19N3O2
Mol. Mass.:
321.3731
SMILES:
Oc1c(ccc2cccnc12)C(N1CCOCC1)c1ccccn1
: