Target
ATP-dependent molecular chaperone HSP82
Ligand
BDBM37694
Substrate
Meas. Tech.
Fluorescence Cell-Based Secondary Assay to Identify Inhibitors of Resistant C. albicans Growth in the Presence of Fluconazole
EC50
2706±2091 nM
Citation
 PubChem, PC Fluorescence Cell-Based Secondary Assay to Identify Inhibitors of Resistant C. albicans Growth in the Presence of Fluconazole PubChem Bioassay (2010)[AID] 
Target
Name:
ATP-dependent molecular chaperone HSP82
Synonyms:
heat shock protein 90
Type:
Enzyme Catalytic Domain
Mol. Mass.:
80784.12
Organism:
Candida albicans
Description:
gi_994798
Residue:
707
  
Inhibitor
Name:
BDBM37694
Synonyms:
5-(2,4-dimethoxyphenyl)-N-(4-methoxy-1,3-benzothiazol-2-yl)-1,3,4-oxadiazol-2-amine SMR000016519 cid_3237187
Type:
Small organic molecule
Emp. Form.:
C18H16N4O4S
Mol. Mass.:
384.409
SMILES:
COc1ccc(-c2nnc(Nc3nc4c(OC)cccc4s3)o2)c(OC)c1
: