Target
ATP-dependent molecular chaperone HSP82
Ligand
BDBM64935
Substrate
Meas. Tech.
Fluorescence Cell-Based Secondary Assay to Identify Inhibitors of Resistant C. albicans Growth in the Presence of Fluconazole
EC50
16251±1357 nM
Citation
 PubChem, PC Fluorescence Cell-Based Secondary Assay to Identify Inhibitors of Resistant C. albicans Growth in the Presence of Fluconazole PubChem Bioassay (2010)[AID] 
Target
Name:
ATP-dependent molecular chaperone HSP82
Synonyms:
heat shock protein 90
Type:
Enzyme Catalytic Domain
Mol. Mass.:
80784.12
Organism:
Candida albicans
Description:
gi_994798
Residue:
707
  
Inhibitor
Name:
BDBM64935
Synonyms:
6-amino-8-(4-methylphenyl)-1,3,8,8a-tetrahydro-2-benzothiopyran-5,7,7-tricarbonitrile 6-amino-8-(4-methylphenyl)-8,8a-dihydro-1H-isothiochromene-5,7,7(3H)-tricarbonitrile 6-azanyl-8-(4-methylphenyl)-1,3,8,8a-tetrahydroisothiochromene-5,7,7-tricarbonitrile SMR000024273 | cid_3239644
Type:
Small organic molecule
Emp. Form.:
C19H16N4S
Mol. Mass.:
332.422
SMILES:
Cc1ccc(cc1)C1C2CSCCC2=C(C#N)C(=N)C1(C#N)C#N
: