Target
Female germline-specific tumor suppressor gld-1
Ligand
BDBM67425
Substrate
Meas. Tech.
Fluorescence polarization-based biochemical high throughput dose response assay for inhibitors of GLD-1 protein - TGE RNA interaction
IC50
>59641±n/a nM
Citation
 PubChem, PC Fluorescence polarization-based biochemical high throughput dose response assay for inhibitors of GLD-1 protein - TGE RNA interaction PubChem Bioassay (2010)[AID] 
Target
Name:
Female germline-specific tumor suppressor gld-1
Synonyms:
GLD1_CAEEL gld-1
Type:
Enzyme Catalytic Domain
Mol. Mass.:
50591.33
Organism:
Caenorhabditis elegans
Description:
gi_17507875
Residue:
463
  
Inhibitor
Name:
BDBM67425
Synonyms:
1-{[Benzyl-(4-fluoro-phenyl)-carbamoyl]-methyl}-4-methyl-1,4-dihydro-pyrrolo[3,2-b]pyrrole-2-carboxylic acid ethyl ester 4-[2-(N-benzyl-4-fluoro-anilino)-2-keto-ethyl]-1-methyl-pyrrolo[3,2-b]pyrrole-5-carboxylic acid ethyl ester SMR000173711 ethyl 4-[2-(N-benzyl-4-fluoroanilino)-2-oxoethyl]-1-methylpyrrolo[3,2-b]pyrrole-5-carboxylate | ethyl 4-[2-[(4-fluorophenyl)-(phenylmethyl)amino]-2-oxidanylidene-ethyl]-1-methyl-pyrrolo[3,2-b]pyrrole-5-carboxylate
Type:
Small organic molecule
Emp. Form.:
C25H24FN3O3
Mol. Mass.:
433.4748
SMILES:
CCOC(=O)c1cc2n(C)ccc2n1CC(=O)N(Cc1ccccc1)c1ccc(F)cc1
: